$ python -m pytest -q --tb=short
..F..................................................................... [ 11%]
........................................................................ [ 23%]
........F............................................................... [ 35%]
........................................................................ [ 47%]
..............F......................................................... [ 59%]
........................................................................ [ 71%]
....................F................................................... [ 83%]
........................................................................ [ 94%]
...............................                                          [100%]
=================================== FAILURES ===================================
______________ test_fixture_ticket_has_a_known_status[KITE-1000] _______________
tests/test_fixtures.py:13: in test_fixture_ticket_has_a_known_status
    assert ticket["status"] in STATUSES, f"{ticket['id']} has status {ticket['status']!r}"
E   AssertionError: KITE-1000 has status 'In progress'
E   assert 'In progress' in ('open', 'in_progress', 'closed')
______________ test_fixture_ticket_has_a_known_status[KITE-1150] _______________
tests/test_fixtures.py:13: in test_fixture_ticket_has_a_known_status
    assert ticket["status"] in STATUSES, f"{ticket['id']} has status {ticket['status']!r}"
E   AssertionError: KITE-1150 has status 'In progress'
E   assert 'In progress' in ('open', 'in_progress', 'closed')
______________ test_fixture_ticket_has_a_known_status[KITE-1300] _______________
tests/test_fixtures.py:13: in test_fixture_ticket_has_a_known_status
    assert ticket["status"] in STATUSES, f"{ticket['id']} has status {ticket['status']!r}"
E   AssertionError: KITE-1300 has status 'In progress'
E   assert 'In progress' in ('open', 'in_progress', 'closed')
______________ test_fixture_ticket_has_a_known_status[KITE-1450] _______________
tests/test_fixtures.py:13: in test_fixture_ticket_has_a_known_status
    assert ticket["status"] in STATUSES, f"{ticket['id']} has status {ticket['status']!r}"
E   AssertionError: KITE-1450 has status 'In progress'
E   assert 'In progress' in ('open', 'in_progress', 'closed')
=========================== short test summary info ============================
FAILED tests/test_fixtures.py::test_fixture_ticket_has_a_known_status[KITE-1000]
FAILED tests/test_fixtures.py::test_fixture_ticket_has_a_known_status[KITE-1150]
FAILED tests/test_fixtures.py::test_fixture_ticket_has_a_known_status[KITE-1300]
FAILED tests/test_fixtures.py::test_fixture_ticket_has_a_known_status[KITE-1450]
4 failed, 603 passed in 0.12s
